kbuild-all

kbuild-all@lists.01.org
  • 83 participants
  • 865 discussions
[jkirsher-next-queue:dev-queue 39/39] make[6]: *** No rule to make target 'drivers/net/ethernet/intel/igc/igc_ptp.o', needed by 'drivers/net/ethernet/intel/igc/built-in.a'.
by kbuild test robot
1 year, 4 months
Re: [PATCH 08/13] video: fbdev: make fbops member of struct fb_info a const pointer
by kbuild test robot
1 year, 4 months
[zen-kernel-zen-kernel:5.4/muqss 1/18] warning: include/uapi/linux/sched.h: leak CONFIG_SCHED_MUQSS to user-space
by kbuild test robot
1 year, 4 months
[jkirsher-next-queue:dev-queue 39/39] make[6]: *** No rule to make target 'drivers/net/ethernet/intel/igc/igc_ptp.o', needed by 'drivers/net/ethernet/intel/igc/igc.o'.
by kbuild test robot
1 year, 4 months
[plbossart-sound:fix/byt-cr 4015/4016] sound/soc/sof/intel/hda-ctrl.c:24:48: error: expected ')' before 'int'
by kbuild test robot
1 year, 4 months
[tip:WIP.x86/mm 31/31] include/linux/vmalloc.h:14:11: fatal error: asm/vmalloc.h: No such file or directory
by kbuild test robot
1 year, 4 months
[linux-next:master 13648/14187] drivers/pci/controller/dwc/pcie-designware-host.c:71:15: error: variable 'dw_pcie_msi_domain_info' has initializer but incomplete type
by kbuild test robot
1 year, 4 months
[lkp] [+935 bytes kernel size regression] [i386-tinyconfig] [cb6be6391b] perf: Init/fini PMU specific data
by kbuild test robot
1 year, 4 months
[lkp] [+1981 bytes kernel size regression] [i386-tinyconfig] [983f33b699] x86/traps: Print address on #GP
by kbuild test robot
1 year, 4 months
[lkp] [+2217 bytes kernel size regression] [i386-tinyconfig] [0b46af671a] configfd: add generic file descriptor based configuration parser
by kbuild test robot
1 year, 4 months
Results per page: